[alsa-devel] Request for test (1.0.18 final)

Alan Horstmann gineera at aspect135.co.uk
Mon Oct 27 21:41:10 CET 2008

On Monday 27 October 2008 13:54, Jaroslav Kysela wrote:
> Hello,
> 	I would like to release 1.0.18 final packages (driver, lib,
> utils, tools, plugins) in few days. Please, report compilation trouble
> with the current ALSA code.
> 			Thank you for testing,
> 						Jaroslav

Here on the 2.4.21-99-Suse, make results in:

../../alsa-kernel/pci/ice1712/ice1712.c:50:22: linux/io.h: No such file or 

presumably caused as it is <asm/io.h> here?

I added temp symbolic link & continued to:

patching file maestro3.c
Hunk #2 succeeded at 2596 (offset 4 lines).
Hunk #3 succeeded at 2777 (offset 4 lines).
gcc -D__KERNEL__ -DMODULE=1 -I/home/alan/Vault/Alsa/1.0.18/
alsa-driver-1.0.18rc3.20.gcbea1.192.g2973f/include  -I/lib/
modules/2.4.21-99-athlon/build/include -O2 -mpreferred-stack-boundary=2 
-march=athlon -DLINUX -Wall -Wstrict-prototypes -fomit-frame-pointer 
-Wno-trigraphs -O2 -fno-strict-aliasing -fno-common -pipe -DALSA_BUILD 
-nostdinc -iwithprefix include -DMODVERSIONS -include /lib/
-DKBUILD_BASENAME=maestro3   -c -o maestro3.o maestro3.c
maestro3.c: In function `snd_m3_create':
maestro3.c:2604: warning: implicit declaration of function `pci_name'
maestro3.c:2604: warning: passing arg 3 of `request_firmware_R38ce5074' makes 
pointer from integer without a cast
maestro3.c:2612: error: structure has no member named `dev'
make[1]: *** [maestro3.o] Error 1
make[1]: Leaving directory `/home/alan/Vault/Alsa/1.0.18/
make: *** [compile] Error 1


More information about the Alsa-devel mailing list