[alsa-devel] 1.0.16rc2

Alan Horstmann gineera at aspect135.co.uk
Wed Jan 30 11:09:15 CET 2008


I get the following compile error:

make[1]: Entering directory `/usr/share/alsa1.0.16rc2/alsa-driver-1.0.16rc2/acore'
gcc -D__KERNEL__ -DMODULE=1 -I/usr/share/alsa1.0.16rc2/alsa-driver-1.0.16rc2/include  -I/lib/modules/2.4.21-99-athlon/build/include -O2 -mpreferred-stack-boundary=2 -march=athlon -DLINUX -Wall -Wstrict-prototypes -fomit-frame-pointer -Wno-trigraphs -O2 -fno-strict-aliasing -fno-common -pipe -DALSA_BUILD -nostdinc -iwithprefix include -DMODVERSIONS -include /lib/modules/2.4.21-99-athlon/build/include/linux/modversions.h   -DEXPORT_SYMTAB -c hwdep.c
In file included from hwdep.c:1:
/usr/share/alsa1.0.16rc2/alsa-driver-1.0.16rc2/include/adriver.h:1461: error: redefinition of `__ffs'
/lib/modules/2.4.21-99-athlon/build/include/asm/bitops.h:410: error: `__ffs' previously defined here
make[1]: *** [hwdep.o] Error 1
make[1]: Leaving directory `/usr/share/alsa1.0.16rc2/alsa-driver-1.0.16rc2/acore'
make: *** [compile] Error 1

I have pasted several lines so you can see the context.  This wasn't a problem in 1.0.14; I haven't compiled since then.


More information about the Alsa-devel mailing list